Reaction Details
TargetPhosphatidylinositol 4,5-bisphosphate 3-kinase catalytic subunit beta isoform
LigandBDBM50363990
Substrate/Competitorn/a
Meas. Tech.ChEMBL_803981 (CHEMBL1954961)
Ki 25±n/a nM
Citation Heffron, TPWei, BOlivero, AStaben, STTsui, VDo, SDotson, JFolkes, AJGoldsmith, PGoldsmith, RGunzner, JLesnick, JLewis, CMathieu, SNonomiya, JShuttleworth, SSutherlin, DPWan, NCWang, SWiesmann, CZhu, BY Rational design of phosphoinositide 3-kinasea inhibitors that exhibit selectivity over the phosphoinositide 3-kinaseß isoform. J Med Chem54:7815-33 (2011) 
 
Phosphatidylinositol 4,5-bisphosphate 3-kinase catalytic subunit beta isoform
Name:Phosphatidylinositol 4,5-bisphosphate 3-kinase catalytic subunit beta isoform
Type:Enzyme Subunit
Mol. Mass.:122769.00
Organism:Homo sapiens (Human)
Description:P42338
Residue:1070
BDBM50363990
NameBDBM50363990
Synonyms:CHEMBL1949915
TypeSmall organic molecule
Emp. Form.C21H27N7O3S2
Mol. Mass.489.614
SMILESCS(=O)(=O)N1CCC(Cc2cc3c(nc(nc3s2)-c2cnc(N)nc2)N2CCOCC2)CC1