Reaction Details
TargetAurora kinase A
LigandBDBM50363992
Substrate/Competitorn/a
Meas. Tech.ChEMBL_804139 (CHEMBL1952704)
Ki 27200±n/a nM
Citation Shomin, CDRestituyo, ECox, KJGhosh, I Selection of cyclic-peptide inhibitors targeting Aurora kinase A: problems and solutions. Bioorg Med Chem19:6743-9 (2011) 
 
Aurora kinase A
Name:Aurora kinase A
Type:Serine/threonine-protein kinase
Mol. Mass.:45830.98
Organism:Homo sapiens (Human)
Description:O14965
Residue:403
BDBM50363992
NameBDBM50363992
Synonyms:CHEMBL1950043
TypeSmall organic molecule
Emp. Form.C51H71N15O10S2
Mol. Mass.1118.334
SMILESCC(C)C[C@@H]1NC(=O)[C@H](Cc2c[nH]c3ccccc23)NC(=O)[C@H](Cc2c[nH]c3ccccc23)NC(=O)[C@@H]2CCCN2C(=O)[C@H](CCCN=C(N)N)NC(=O)[C@@H](NC(=O)[C@@H](N)CSSC[C@H](NC1=O)C(=O)NCC(N)=O)[C@@H](C)O