Reaction Details
TargetCyclin-dependent kinase 2
LigandBDBM60927
Substrate/Competitorn/a
Meas. Tech.ChEMBL_803989 (CHEMBL1954969)
Kd 37000±n/a nM
Citation Shomin, CDRestituyo, ECox, KJGhosh, I Selection of cyclic-peptide inhibitors targeting Aurora kinase A: problems and solutions. Bioorg Med Chem19:6743-9 (2011) 
 
Cyclin-dependent kinase 2
Name:Cyclin-dependent kinase 2
Type:Enzyme Subunit
Mol. Mass.:33938.17
Organism:Homo sapiens (Human)
Description:P24941
Residue:298
BDBM60927
NameBDBM60927
Synonyms:1-anilinonaphthalene-8-sulfonic acid ANS BDBM50126831
Typen/a
Emp. Form.C16H13NO3S
Mol. Mass.299.344
SMILESOS(=O)(=O)c1cccc2cccc(Nc3ccccc3)c12