Reaction Details
TargetPapain
LigandBDBM50364010
Substrate/Competitorn/a
Meas. Tech.ChEMBL_804542 (CHEMBL1952735)
Ki 23±n/a nM
Citation Bhattacharya, AKRana, KC Design, synthesis and biological evaluation of peptidyl-vinylaminophosphonates as novel cysteine protease inhibitors. Bioorg Med Chem19:7129-35 (2011) 
 
Papain
Name:Papain
Type:Enzyme
Mol. Mass.:38923.01
Organism:Carica papaya
Description:Papain was purchased from Sigma, Germany.
Residue:345
BDBM50364010
NameBDBM50364010
Synonyms:CHEMBL1950263
TypeSmall organic molecule
Emp. Form.C30H43N9O5
Mol. Mass.609.7197
SMILES[#6]-[#6]-[#6@H](-[#6])-[#6@H](-[#7]-[#6](=O)-[#6@H](-[#6]-[#6]-[#6]\[#7]=[#6](\[#7])-[#7])-[#7]-[#6](=O)-[#8]-[#6]-c1ccccc1)-[#6](=O)-[#7]-[#6@@H](-[#6]-c1ccccc1)-[#6]=[#7]-[#7]-[#6](-[#7])=O