Reaction Details
TargetAdenosine receptor A2a
LigandBDBM14487
Substrate/Competitorn/a
Meas. Tech.ChEMBL_805333 (CHEMBL1955226)
Ki 20±n/a nM
Citation Deflorian, FKumar, TSPhan, KGao, ZGXu, FWu, HKatritch, VStevens, RCJacobson, KA Evaluation of molecular modeling of agonist binding in light of the crystallographic structure of an agonist-bound A2A adenosine receptor. J Med Chem55:538-52 (2012) 
 
Adenosine receptor A2a
Name:Adenosine receptor A2a
Type:G Protein-Coupled Receptor (GPCR)
Mol. Mass.:44716.46
Organism:Homo sapiens (Human)
Description:P29274
Residue:412
BDBM14487
NameBDBM14487
Synonyms:(2R,3R,4S,5R)-2-(6-amino-9H-purin-9-yl)-5-(hydroxymethyl)oxolane-3,4-diol Adenosine N6-Methylado cid_191 | cid_60961
TypeNucleoside or nucleotide
Emp. Form.C10H13N5O4
Mol. Mass.267.2413
SMILESNc1ncnc2n(cnc12)[C@@H]1O[C@H](CO)[C@@H](O)[C@H]1O