Reaction Details
TargetAdenosine receptor A2a
LigandBDBM50364061
Substrate/Competitorn/a
Meas. Tech.ChEMBL_805340 (CHEMBL1955233)
Ki 2.3±n/a nM
Citation Deflorian, FKumar, TSPhan, KGao, ZGXu, FWu, HKatritch, VStevens, RCJacobson, KA Evaluation of molecular modeling of agonist binding in light of the crystallographic structure of an agonist-bound A2A adenosine receptor. J Med Chem55:538-52 (2012) 
 
Adenosine receptor A2a
Name:Adenosine receptor A2a
Type:G Protein-Coupled Receptor (GPCR)
Mol. Mass.:44716.46
Organism:Homo sapiens (Human)
Description:P29274
Residue:412
BDBM50364061
NameBDBM50364061
Synonyms:CHEMBL1950652
TypeSmall organic molecule
Emp. Form.C21H26N10O4
Mol. Mass.482.4957
SMILESCCn1nnnc1[C@H]1O[C@H]([C@H](O)[C@@H]1O)n1cnc2c(N)nc(N[C@H](CO)Cc3ccccc3)nc12