Reaction Details
TargetP2Y purinoceptor 2
LigandBDBM50205413
Substrate/Competitorn/a
Meas. Tech.ChEMBL_805342 (CHEMBL1955235)
EC50 60±n/a nM
Citation Yelovitch, SCamden, JWeisman, GAFischer, B Boranophosphate isoster controls P2Y-receptor subtype selectivity and metabolic stability of dinucleoside polyphosphate analogues. J Med Chem55:437-48 (2012) 
 
P2Y purinoceptor 2
Name:P2Y purinoceptor 2
Type:PROTEIN
Mol. Mass.:42299.21
Organism:Homo sapiens (Human)
Description:ChEMBL_1455361
Residue:377
BDBM50205413
NameBDBM50205413
Synonyms:CHEMBL221326 P1,P4-Bis(5'-uridyl) tetrahydrogen tetraphosphate
TypeSmall organic molecule
Emp. Form.C18H26N4O23P4
Mol. Mass.790.3071
SMILESO[C@@H]1[C@@H](COP(O)(=O)OP(O)(=O)OP(O)(=O)OP(O)(=O)OC[C@H]2O[C@H]([C@H](O)[C@@H]2O)n2ccc(=O)[nH]c2=O)O[C@H]([C@@H]1O)n1ccc(=O)[nH]c1=O