Reaction Details
TargetCannabinoid receptor 2
LigandBDBM50364080
Substrate/Competitorn/a
Meas. Tech.ChEMBL_803200 (CHEMBL1954911)
EC50 1.1±n/a nM
Citation Gijsen, HJDe Cleyn, MASurkyn, MVan Lommen, GRVerbist, BMNijsen, MJMeert, TWauwe, JVAerssens, J 5-sulfonyl-benzimidazoles as selective CB2 agonists-part 2. Bioorg Med Chem Lett22:547-52 (2011) 
 
Cannabinoid receptor 2
Name:Cannabinoid receptor 2
Type:G Protein-Coupled Receptor (GPCR)
Mol. Mass.:39690.94
Organism:Homo sapiens (Human)
Description:P34972
Residue:360
BDBM50364080
NameBDBM50364080
Synonyms:CHEMBL401610
TypeSmall organic molecule
Emp. Form.C21H29F3N2O3S
Mol. Mass.446.527
SMILESCC(C)(C)c1nc2cc(ccc2n1CC1CCOCC1)S(=O)(=O)CCCC(F)(F)F