Reaction Details
TargetCannabinoid receptor 1
LigandBDBM50364083
Substrate/Competitorn/a
Meas. Tech.ChEMBL_803201 (CHEMBL1954912)
EC50 3850±n/a nM
Citation Gijsen, HJDe Cleyn, MASurkyn, MVan Lommen, GRVerbist, BMNijsen, MJMeert, TWauwe, JVAerssens, J 5-sulfonyl-benzimidazoles as selective CB2 agonists-part 2. Bioorg Med Chem Lett22:547-52 (2011) 
 
Cannabinoid receptor 1
Name:Cannabinoid receptor 1
Type:G Protein-Coupled Receptor (GPCR)
Mol. Mass.:52868.96
Organism:Homo sapiens (Human)
Description:P21554
Residue:472
BDBM50364083
NameBDBM50364083
Synonyms:CHEMBL1950830
TypeSmall organic molecule
Emp. Form.C26H35N3O5S
Mol. Mass.501.638
SMILESCOCCCOc1cc(ccn1)S(=O)(=O)c1ccc2n(CC3CCOCC3)c(nc2c1)C(C)(C)C