Reaction Details
TargetCannabinoid receptor 1
LigandBDBM50364088
Substrate/Competitorn/a
Meas. Tech.ChEMBL_803201 (CHEMBL1954912)
EC50 8320±n/a nM
Citation Gijsen, HJDe Cleyn, MASurkyn, MVan Lommen, GRVerbist, BMNijsen, MJMeert, TWauwe, JVAerssens, J 5-sulfonyl-benzimidazoles as selective CB2 agonists-part 2. Bioorg Med Chem Lett22:547-52 (2011) 
 
Cannabinoid receptor 1
Name:Cannabinoid receptor 1
Type:G Protein-Coupled Receptor (GPCR)
Mol. Mass.:52868.96
Organism:Homo sapiens (Human)
Description:P21554
Residue:472
BDBM50364088
NameBDBM50364088
Synonyms:CHEMBL1950835
TypeSmall organic molecule
Emp. Form.C26H34N4O4S
Mol. Mass.498.638
SMILESCC(=O)NCCc1cc(ccn1)S(=O)(=O)c1ccc2n(CC3CCOCC3)c(nc2c1)C(C)(C)C