Reaction Details
TargetCannabinoid receptor 1
LigandBDBM50364093
Substrate/Competitorn/a
Meas. Tech.ChEMBL_803201 (CHEMBL1954912)
EC50>10000±n/a nM
Citation Gijsen, HJDe Cleyn, MASurkyn, MVan Lommen, GRVerbist, BMNijsen, MJMeert, TWauwe, JVAerssens, J 5-sulfonyl-benzimidazoles as selective CB2 agonists-part 2. Bioorg Med Chem Lett22:547-52 (2011) 
 
Cannabinoid receptor 1
Name:Cannabinoid receptor 1
Type:G Protein-Coupled Receptor (GPCR)
Mol. Mass.:52868.96
Organism:Homo sapiens (Human)
Description:P21554
Residue:472
BDBM50364093
NameBDBM50364093
Synonyms:CHEMBL1950840
TypeSmall organic molecule
Emp. Form.C23H29F6N3O3S
Mol. Mass.541.55
SMILESCC(C)(C)c1nc2cc(ccc2n1CC1CCN(CC1)C(=O)C(F)(F)F)S(=O)(=O)CCCC(F)(F)F