Reaction Details
TargetCannabinoid receptor 1
LigandBDBM50364105
Substrate/Competitorn/a
Meas. Tech.ChEMBL_803201 (CHEMBL1954912)
EC50>10000±n/a nM
Citation Gijsen, HJDe Cleyn, MASurkyn, MVan Lommen, GRVerbist, BMNijsen, MJMeert, TWauwe, JVAerssens, J 5-sulfonyl-benzimidazoles as selective CB2 agonists-part 2. Bioorg Med Chem Lett22:547-52 (2011) 
 
Cannabinoid receptor 1
Name:Cannabinoid receptor 1
Type:G Protein-Coupled Receptor (GPCR)
Mol. Mass.:52868.96
Organism:Homo sapiens (Human)
Description:P21554
Residue:472
BDBM50364105
NameBDBM50364105
Synonyms:CHEMBL1950931
TypeSmall organic molecule
Emp. Form.C25H30FN3O3S
Mol. Mass.471.587
SMILESCC(=O)N1CCC(Cn2c(nc3cc(ccc23)S(=O)(=O)c2ccc(F)cc2)C(C)(C)C)CC1