Reaction Details
TargetCannabinoid receptor 1
LigandBDBM50364080
Substrate/Competitorn/a
Meas. Tech.ChEMBL_803201 (CHEMBL1954912)
EC50 320±n/a nM
Citation Gijsen, HJDe Cleyn, MASurkyn, MVan Lommen, GRVerbist, BMNijsen, MJMeert, TWauwe, JVAerssens, J 5-sulfonyl-benzimidazoles as selective CB2 agonists-part 2. Bioorg Med Chem Lett22:547-52 (2011) 
 
Cannabinoid receptor 1
Name:Cannabinoid receptor 1
Type:G Protein-Coupled Receptor (GPCR)
Mol. Mass.:52868.96
Organism:Homo sapiens (Human)
Description:P21554
Residue:472
BDBM50364080
NameBDBM50364080
Synonyms:CHEMBL401610
TypeSmall organic molecule
Emp. Form.C21H29F3N2O3S
Mol. Mass.446.527
SMILESCC(C)(C)c1nc2cc(ccc2n1CC1CCOCC1)S(=O)(=O)CCCC(F)(F)F