Reaction Details
TargetCannabinoid receptor 2
LigandBDBM50364083
Substrate/Competitorn/a
Meas. Tech.ChEMBL_803200 (CHEMBL1954911)
EC50 0.5±n/a nM
Citation Gijsen, HJDe Cleyn, MASurkyn, MVan Lommen, GRVerbist, BMNijsen, MJMeert, TWauwe, JVAerssens, J 5-sulfonyl-benzimidazoles as selective CB2 agonists-part 2. Bioorg Med Chem Lett22:547-52 (2011) 
 
Cannabinoid receptor 2
Name:Cannabinoid receptor 2
Type:G Protein-Coupled Receptor (GPCR)
Mol. Mass.:39690.94
Organism:Homo sapiens (Human)
Description:P34972
Residue:360
BDBM50364083
NameBDBM50364083
Synonyms:CHEMBL1950830
TypeSmall organic molecule
Emp. Form.C26H35N3O5S
Mol. Mass.501.638
SMILESCOCCCOc1cc(ccn1)S(=O)(=O)c1ccc2n(CC3CCOCC3)c(nc2c1)C(C)(C)C