Reaction Details
TargetCannabinoid receptor 2
LigandBDBM50364090
Substrate/Competitorn/a
Meas. Tech.ChEMBL_803200 (CHEMBL1954911)
EC50 2.4±n/a nM
Citation Gijsen, HJDe Cleyn, MASurkyn, MVan Lommen, GRVerbist, BMNijsen, MJMeert, TWauwe, JVAerssens, J 5-sulfonyl-benzimidazoles as selective CB2 agonists-part 2. Bioorg Med Chem Lett22:547-52 (2011) 
 
Cannabinoid receptor 2
Name:Cannabinoid receptor 2
Type:G Protein-Coupled Receptor (GPCR)
Mol. Mass.:39690.94
Organism:Homo sapiens (Human)
Description:P34972
Residue:360
BDBM50364090
NameBDBM50364090
Synonyms:CHEMBL1950837
TypeSmall organic molecule
Emp. Form.C22H30F3N3O3S
Mol. Mass.473.552
SMILESCC(C)(C)c1nc2cc(ccc2n1CC1CCN(CC1)C=O)S(=O)(=O)CCCC(F)(F)F