Reaction Details
TargetCannabinoid receptor 2
LigandBDBM50364091
Substrate/Competitorn/a
Meas. Tech.ChEMBL_803200 (CHEMBL1954911)
EC50 13±n/a nM
Citation Gijsen, HJDe Cleyn, MASurkyn, MVan Lommen, GRVerbist, BMNijsen, MJMeert, TWauwe, JVAerssens, J 5-sulfonyl-benzimidazoles as selective CB2 agonists-part 2. Bioorg Med Chem Lett22:547-52 (2011) 
 
Cannabinoid receptor 2
Name:Cannabinoid receptor 2
Type:G Protein-Coupled Receptor (GPCR)
Mol. Mass.:39690.94
Organism:Homo sapiens (Human)
Description:P34972
Residue:360
BDBM50364091
NameBDBM50364091
Synonyms:CHEMBL1950838
TypeSmall organic molecule
Emp. Form.C23H32F3N3O3S
Mol. Mass.487.579
SMILESCC(=O)N1CCC(Cn2c(nc3cc(ccc23)S(=O)(=O)CCCC(F)(F)F)C(C)(C)C)CC1