Reaction Details
TargetDipeptidyl peptidase 4
LigandBDBM50364171
Substrate/Competitorn/a
Meas. Tech.ChEMBL_803854 (CHEMBL1954392)
IC50 0.500000±n/a nM
Citation Sutton, JMClark, DEDunsdon, SJFenton, GFillmore, AHarris, NVHiggs, CHurley, CAKrintel, SLMacKenzie, REDuttaroy, AGangl, EManiara, WSedrani, RNamoto, KOstermann, NGerhartz, BSirockin, FTrappe, JHassiepen, UBaeschlin, DK Novel heterocyclic DPP-4 inhibitors for the treatment of type 2 diabetes. Bioorg Med Chem Lett22:1464-8 (2012) 
 
Dipeptidyl peptidase 4
Name:Dipeptidyl peptidase 4
Type:Enzyme
Mol. Mass.:88271.01
Organism:Homo sapiens (Human)
Description:P27487
Residue:766
BDBM50364171
NameBDBM50364171
Synonyms:CHEMBL1951598
TypeSmall organic molecule
Emp. Form.C27H32N6O4
Mol. Mass.504.5808
SMILES[#6]-[#8]-c1cccc(c1)-[#6](=O)-[#6]-n1c(=O)n(-[#6])c2c(C#N)c(-[#7]-3-[#6]-[#6]-[#6]-[#6@H](-[#7])-[#6]-3)n(-[#6]\[#6]=[#6](\[#6])-[#6])c2c1=O