Reaction Details
TargetSubstance-P receptor
LigandBDBM50364192
Substrate/Competitorn/a
Meas. Tech.ChEMBL_804013 (CHEMBL1954993)
IC50 0.046±n/a nM
Citation Shirai, JSugiyama, HMorimoto, SMaezaki, HYamamoto, YOkanishi, SKamo, IMatsumoto, SIshigami, KInatomi, NImanishi, AKawamoto, MTarui, NHashimoto, TIkeura, Y Novel 3-phenylpiperidine-4-carboxamides as highly potent and orally long-acting neurokinin-1 receptor antagonists with reduced CYP3A induction. Bioorg Med Chem20:962-77 (2012) 
 
Substance-P receptor
Name:Substance-P receptor
Type:G Protein-Coupled Receptor (GPCR)
Mol. Mass.:46254.43
Organism:Homo sapiens (Human)
Description:P25103
Residue:407
BDBM50364192
NameBDBM50364192
Synonyms:CHEMBL1951811
TypeSmall organic molecule
Emp. Form.C25H24F7N3O4
Mol. Mass.563.4646
SMILESCN(Cc1cc(cc(c1)C(F)(F)F)C(F)(F)F)C(=O)[C@H]1CCN(C[C@@H]1c1ccc(F)cc1C)C(=O)C(=O)NO