Reaction Details
TargetFatty-acid amide hydrolase 1
LigandBDBM50364256
Substrate/Competitorn/a
Meas. Tech.ChEMBL_804223 (CHEMBL1954237)
IC50 27900±n/a nM
Citation Roughley, SDBrowne, HMacias, ATBenwell, KBrooks, TD'Alessandro, JDaniels, ZDugdale, SFrancis, GGibbons, BHart, THaymes, TKennett, GLightowler, SMatassova, NMansell, HMerrett, AMisra, APadfield, AParsons, RPratt, RRobertson, ASimmonite, HTan, KWalls, SBWong, M Fatty acid amide hydrolase inhibitors. 3: tetra-substituted azetidine ureas with in vivo activity. Bioorg Med Chem Lett22:901-6 (2012) 
 
Fatty-acid amide hydrolase 1
Name:Fatty-acid amide hydrolase 1
Type:Protein
Mol. Mass.:63071.19
Organism:Homo sapiens (Human)
Description:O00519
Residue:579
BDBM50364256
NameBDBM50364256
Synonyms:CHEMBL1952088
TypeSmall organic molecule
Emp. Form.C20H21Cl2N3O3
Mol. Mass.422.305
SMILESClc1ccc(cc1)C(OC1CN(C1)C(=O)N1CCOCC1)c1cccnc1Cl