Reaction Details
TargetFatty-acid amide hydrolase 1
LigandBDBM50364267
Substrate/Competitorn/a
Meas. Tech.ChEMBL_804223 (CHEMBL1954237)
IC50 17400±n/a nM
Citation Roughley, SDBrowne, HMacias, ATBenwell, KBrooks, TD'Alessandro, JDaniels, ZDugdale, SFrancis, GGibbons, BHart, THaymes, TKennett, GLightowler, SMatassova, NMansell, HMerrett, AMisra, APadfield, AParsons, RPratt, RRobertson, ASimmonite, HTan, KWalls, SBWong, M Fatty acid amide hydrolase inhibitors. 3: tetra-substituted azetidine ureas with in vivo activity. Bioorg Med Chem Lett22:901-6 (2012) 
 
Fatty-acid amide hydrolase 1
Name:Fatty-acid amide hydrolase 1
Type:Protein
Mol. Mass.:63071.19
Organism:Homo sapiens (Human)
Description:O00519
Residue:579
BDBM50364267
NameBDBM50364267
Synonyms:CHEMBL1952099
TypeSmall organic molecule
Emp. Form.C22H25Cl2N3O3
Mol. Mass.450.358
SMILESOCC1CCN(CC1)C(=O)N1CC(C1)OC(c1ccc(Cl)cc1)c1cccnc1Cl