Reaction Details
TargetEndothelial lipase
LigandBDBM50364281
Substrate/Competitorn/a
Meas. Tech.ChEMBL_804415 (CHEMBL1954842)
IC50 11000±n/a nM
Citation O'Connell, DPLeBlanc, DFCromley, DBillheimer, JRader, DJBachovchin, WW Design and synthesis of boronic acid inhibitors of endothelial lipase. Bioorg Med Chem Lett22:1397-401 (2012) 
 
Endothelial lipase
Name:Endothelial lipase
Type:Protein
Mol. Mass.:56805.62
Organism:Homo sapiens (Human)
Description:Q9Y5X9
Residue:500
BDBM50364281
NameBDBM50364281
Synonyms:CHEMBL1952294
TypeSmall organic molecule
Emp. Form.C8H11BO2
Mol. Mass.149.983
SMILESCCc1ccc(cc1)B(O)O