Reaction Details
TargetEndothelial lipase
LigandBDBM50364296
Substrate/Competitorn/a
Meas. Tech.ChEMBL_804415 (CHEMBL1954842)
IC50 1600±n/a nM
Citation O'Connell, DPLeBlanc, DFCromley, DBillheimer, JRader, DJBachovchin, WW Design and synthesis of boronic acid inhibitors of endothelial lipase. Bioorg Med Chem Lett22:1397-401 (2012) 
 
Endothelial lipase
Name:Endothelial lipase
Type:Protein
Mol. Mass.:56805.62
Organism:Homo sapiens (Human)
Description:Q9Y5X9
Residue:500
BDBM50364296
NameBDBM50364296
Synonyms:CHEMBL1952308
TypeSmall organic molecule
Emp. Form.C18H20BFO2
Mol. Mass.298.16
SMILESCC1(C)OB(OC1(C)C)c1ccc(cc1)-c1ccc(F)cc1