Reaction Details
TargetLipoprotein lipase
LigandBDBM50067895
Substrate/Competitorn/a
Meas. Tech.ChEMBL_804416 (CHEMBL1954843)
IC50 9000±n/a nM
Citation O'Connell, DPLeBlanc, DFCromley, DBillheimer, JRader, DJBachovchin, WW Design and synthesis of boronic acid inhibitors of endothelial lipase. Bioorg Med Chem Lett22:1397-401 (2012) 
 
Lipoprotein lipase
Name:Lipoprotein lipase
Type:PROTEIN
Mol. Mass.:53173.96
Organism:Homo sapiens (Human)
Description:ChEMBL_1280894
Residue:475
BDBM50067895
NameBDBM50067895
Synonyms:CHEMBL140780 p-tolylboronic acid
TypeSmall organic molecule
Emp. Form.C7H9BO2
Mol. Mass.135.956
SMILESCc1ccc(cc1)B(O)O