Reaction Details
TargetLipoprotein lipase
LigandBDBM26134
Substrate/Competitorn/a
Meas. Tech.ChEMBL_804416 (CHEMBL1954843)
IC50 42000±n/a nM
Citation O'Connell, DPLeBlanc, DFCromley, DBillheimer, JRader, DJBachovchin, WW Design and synthesis of boronic acid inhibitors of endothelial lipase. Bioorg Med Chem Lett22:1397-401 (2012) 
 
Lipoprotein lipase
Name:Lipoprotein lipase
Type:PROTEIN
Mol. Mass.:53173.96
Organism:Homo sapiens (Human)
Description:ChEMBL_1280894
Residue:475
BDBM26134
NameBDBM26134
Synonyms:(4-nonylphenyl)boranediol | Phenylboronic Acid, 13
TypeSmall organic molecule
Emp. Form.C15H25BO2
Mol. Mass.248.169
SMILESCCCCCCCCCc1ccc(cc1)B(O)O