Reaction Details
TargetLipoprotein lipase
LigandBDBM50364285
Substrate/Competitorn/a
Meas. Tech.ChEMBL_804416 (CHEMBL1954843)
IC50 50000±n/a nM
Citation O'Connell, DPLeBlanc, DFCromley, DBillheimer, JRader, DJBachovchin, WW Design and synthesis of boronic acid inhibitors of endothelial lipase. Bioorg Med Chem Lett22:1397-401 (2012) 
 
Lipoprotein lipase
Name:Lipoprotein lipase
Type:PROTEIN
Mol. Mass.:53173.96
Organism:Homo sapiens (Human)
Description:ChEMBL_1280894
Residue:475
BDBM50364285
NameBDBM50364285
Synonyms:CHEMBL1952298
TypeSmall organic molecule
Emp. Form.C17H29BO2
Mol. Mass.276.222
SMILESCCCCCCCCCCCc1ccc(cc1)B(O)O