Reaction Details
TargetLipoprotein lipase
LigandBDBM50364291
Substrate/Competitorn/a
Meas. Tech.ChEMBL_804416 (CHEMBL1954843)
IC50 55000±n/a nM
Citation O'Connell, DPLeBlanc, DFCromley, DBillheimer, JRader, DJBachovchin, WW Design and synthesis of boronic acid inhibitors of endothelial lipase. Bioorg Med Chem Lett22:1397-401 (2012) 
 
Lipoprotein lipase
Name:Lipoprotein lipase
Type:PROTEIN
Mol. Mass.:53173.96
Organism:Homo sapiens (Human)
Description:ChEMBL_1280894
Residue:475
BDBM50364291
NameBDBM50364291
Synonyms:CHEMBL1952304
TypeSmall organic molecule
Emp. Form.C19H31BO2
Mol. Mass.302.259
SMILESCCCCCCCc1ccc(cc1)B1OC(C)(C)C(C)(C)O1