Reaction Details
TargetEndothelial lipase
LigandBDBM50364293
Substrate/Competitorn/a
Meas. Tech.ChEMBL_804418 (CHEMBL1954845)
IC50 1400±n/a nM
Citation O'Connell, DPLeBlanc, DFCromley, DBillheimer, JRader, DJBachovchin, WW Design and synthesis of boronic acid inhibitors of endothelial lipase. Bioorg Med Chem Lett22:1397-401 (2012) 
 
Endothelial lipase
Name:Endothelial lipase
Type:Protein
Mol. Mass.:56805.62
Organism:Homo sapiens (Human)
Description:Q9Y5X9
Residue:500
BDBM50364293
NameBDBM50364293
Synonyms:CHEMBL1952305
TypeSmall organic molecule
Emp. Form.C23H39BO2
Mol. Mass.358.366
SMILESCCCCCCCCCCCc1ccc(cc1)B1OC(C)(C)C(C)(C)O1