Reaction Details
TargetLipoprotein lipase
LigandBDBM50364284
Substrate/Competitorn/a
Meas. Tech.ChEMBL_804419 (CHEMBL1954846)
IC50 9000±n/a nM
Citation O'Connell, DPLeBlanc, DFCromley, DBillheimer, JRader, DJBachovchin, WW Design and synthesis of boronic acid inhibitors of endothelial lipase. Bioorg Med Chem Lett22:1397-401 (2012) 
 
Lipoprotein lipase
Name:Lipoprotein lipase
Type:PROTEIN
Mol. Mass.:53173.96
Organism:Homo sapiens (Human)
Description:ChEMBL_1280894
Residue:475
BDBM50364284
NameBDBM50364284
Synonyms:CHEMBL1952297
TypeSmall organic molecule
Emp. Form.C13H21BO2
Mol. Mass.220.116
SMILESCCCCCCCc1ccc(cc1)B(O)O