Reaction Details
TargetLipoprotein lipase
LigandBDBM50364293
Substrate/Competitorn/a
Meas. Tech.ChEMBL_804419 (CHEMBL1954846)
IC50 15000±n/a nM
Citation O'Connell, DPLeBlanc, DFCromley, DBillheimer, JRader, DJBachovchin, WW Design and synthesis of boronic acid inhibitors of endothelial lipase. Bioorg Med Chem Lett22:1397-401 (2012) 
 
Lipoprotein lipase
Name:Lipoprotein lipase
Type:PROTEIN
Mol. Mass.:53173.96
Organism:Homo sapiens (Human)
Description:ChEMBL_1280894
Residue:475
BDBM50364293
NameBDBM50364293
Synonyms:CHEMBL1952305
TypeSmall organic molecule
Emp. Form.C23H39BO2
Mol. Mass.358.366
SMILESCCCCCCCCCCCc1ccc(cc1)B1OC(C)(C)C(C)(C)O1