Reaction Details
TargetLipoprotein lipase
LigandBDBM50364296
Substrate/Competitorn/a
Meas. Tech.ChEMBL_804419 (CHEMBL1954846)
IC50 33000±n/a nM
Citation O'Connell, DPLeBlanc, DFCromley, DBillheimer, JRader, DJBachovchin, WW Design and synthesis of boronic acid inhibitors of endothelial lipase. Bioorg Med Chem Lett22:1397-401 (2012) 
 
Lipoprotein lipase
Name:Lipoprotein lipase
Type:PROTEIN
Mol. Mass.:53173.96
Organism:Homo sapiens (Human)
Description:ChEMBL_1280894
Residue:475
BDBM50364296
NameBDBM50364296
Synonyms:CHEMBL1952308
TypeSmall organic molecule
Emp. Form.C18H20BFO2
Mol. Mass.298.16
SMILESCC1(C)OB(OC1(C)C)c1ccc(cc1)-c1ccc(F)cc1