Reaction Details
TargetEndothelial lipase
LigandBDBM50364282
Substrate/Competitorn/a
Meas. Tech.ChEMBL_804418 (CHEMBL1954845)
IC50 4000±n/a nM
Citation O'Connell, DPLeBlanc, DFCromley, DBillheimer, JRader, DJBachovchin, WW Design and synthesis of boronic acid inhibitors of endothelial lipase. Bioorg Med Chem Lett22:1397-401 (2012) 
 
Endothelial lipase
Name:Endothelial lipase
Type:Protein
Mol. Mass.:56805.62
Organism:Homo sapiens (Human)
Description:Q9Y5X9
Residue:500
BDBM50364282
NameBDBM50364282
Synonyms:CHEMBL1952295
TypeSmall organic molecule
Emp. Form.C9H13BO2
Mol. Mass.164.009
SMILESCCCc1ccc(cc1)B(O)O