Reaction Details
TargetBeta-secretase 1
LigandBDBM50070942
Substrate/Competitorn/a
Meas. Tech.ChEMBL_804422 (CHEMBL1954849)
IC50 757±n/a nM
Citation Cheng, XRZhou, JWZhou, YCheng, JPYang, RFZhou, WXZhang, YXYun, LH The green tea polyphenol (2)-epigallocatechin-3-gallate (EGCG) is not aß-secretase inhibitor. Bioorg Med Chem Lett22:1408-14 (2012) 
 
Beta-secretase 1
Name:Beta-secretase 1
Type:Protein
Mol. Mass.:55755.10
Organism:Homo sapiens (Human)
Description:P56817
Residue:501
BDBM50070942
NameBDBM50070942
Synonyms:(-)-Epigallocatechin gallate (-)-epigallocatechin 3-gallate CHEMBL297453 Epigallocatechin 3-gallate cid_65064
TypeSmall organic molecule
Emp. Form.C22H18O11
Mol. Mass.458.3717
SMILESOc1cc(O)c2C[C@@H](OC(=O)c3cc(O)c(O)c(O)c3)[C@H](Oc2c1)c1cc(O)c(O)c(O)c1