Reaction Details
TargetCytochrome P450 3A4
LigandBDBM50364330
Substrate/Competitorn/a
Meas. Tech.ChEMBL_804824 (CHEMBL1953643)
IC50 2900±n/a nM
Citation McElroy, WTTan, ZBasu, KYang, SWSmotryski, JHo, GDTulshian, DGreenlee, WJMullins, DGuzzi, MZhang, XBleickardt, CHodgson, R Pyrazoloquinolines as PDE10A inhibitors: discovery of a tool compound. Bioorg Med Chem Lett22:1335-9 (2012) 
 
Cytochrome P450 3A4
Name:Cytochrome P450 3A4
Type:Enzyme
Mol. Mass.:57349.57
Organism:Homo sapiens (Human)
Description:n/a
Residue:503
BDBM50364330
NameBDBM50364330
Synonyms:CHEMBL1949936
TypeSmall organic molecule
Emp. Form.C19H18N4O2
Mol. Mass.334.3718
SMILESCOc1cc(C)c2nc3[nH]nc(C)c3c(C(O)c3ccncc3)c2c1