Reaction Details
TargetCytochrome P450 3A4
LigandBDBM50364344
Substrate/Competitorn/a
Meas. Tech.ChEMBL_804823 (CHEMBL1953642)
IC50 1200±n/a nM
Citation McElroy, WTTan, ZBasu, KYang, SWSmotryski, JHo, GDTulshian, DGreenlee, WJMullins, DGuzzi, MZhang, XBleickardt, CHodgson, R Pyrazoloquinolines as PDE10A inhibitors: discovery of a tool compound. Bioorg Med Chem Lett22:1335-9 (2012) 
 
Cytochrome P450 3A4
Name:Cytochrome P450 3A4
Type:Enzyme
Mol. Mass.:57349.57
Organism:Homo sapiens (Human)
Description:n/a
Residue:503
BDBM50364344
NameBDBM50364344
Synonyms:CHEMBL1950078
TypeSmall organic molecule
Emp. Form.C21H21N3O3
Mol. Mass.363.4097
SMILESCOc1ccc(cc1)C(O)c1c2c(C)n[nH]c2nc2c(C)cc(OC)cc12