Reaction Details
TargetcAMP and cAMP-inhibited cGMP 3',5'-cyclic phosphodiesterase 10A
LigandBDBM50364340
Substrate/Competitorn/a
Meas. Tech.ChEMBL_804822 (CHEMBL1953641)
Ki 0.3±n/a nM
Citation McElroy, WTTan, ZBasu, KYang, SWSmotryski, JHo, GDTulshian, DGreenlee, WJMullins, DGuzzi, MZhang, XBleickardt, CHodgson, R Pyrazoloquinolines as PDE10A inhibitors: discovery of a tool compound. Bioorg Med Chem Lett22:1335-9 (2012) 
 
cAMP and cAMP-inhibited cGMP 3',5'-cyclic phosphodiesterase 10A
Name:cAMP and cAMP-inhibited cGMP 3',5'-cyclic phosphodiesterase 10A
Type:Protein
Mol. Mass.:88412.52
Organism:Homo sapiens (Human)
Description:Q9Y233
Residue:779
BDBM50364340
NameBDBM50364340
Synonyms:CHEMBL1950084
TypeSmall organic molecule
Emp. Form.C19H17FN4O
Mol. Mass.336.3629
SMILESCOc1cc(C)c2nc3[nH]nc(C)c3c(C(F)c3ccncc3)c2c1