Reaction Details
TargetCytochrome P450 3A4
LigandBDBM50364335
Substrate/Competitorn/a
Meas. Tech.ChEMBL_804824 (CHEMBL1953643)
IC50 7400±n/a nM
Citation McElroy, WTTan, ZBasu, KYang, SWSmotryski, JHo, GDTulshian, DGreenlee, WJMullins, DGuzzi, MZhang, XBleickardt, CHodgson, R Pyrazoloquinolines as PDE10A inhibitors: discovery of a tool compound. Bioorg Med Chem Lett22:1335-9 (2012) 
 
Cytochrome P450 3A4
Name:Cytochrome P450 3A4
Type:Enzyme
Mol. Mass.:57349.57
Organism:Homo sapiens (Human)
Description:n/a
Residue:503
BDBM50364335
NameBDBM50364335
Synonyms:CHEMBL1950089
TypeSmall organic molecule
Emp. Form.C16H13ClN4O2
Mol. Mass.328.753
SMILESCc1n[nH]c2nc3c(C)cc(Cl)cc3c(C(O)c3ncco3)c12