Reaction Details
TargetLegumain
LigandBDBM50364359
Substrate/Competitorn/a
Meas. Tech.ChEMBL_805028 (CHEMBL1952889)
IC50 638±n/a nM
Citation Lee, JBogyo, M Synthesis and evaluation of aza-peptidyl inhibitors of the lysosomal asparaginyl endopeptidase, legumain. Bioorg Med Chem Lett22:1340-3 (2012) 
 
Legumain
Name:Legumain
Type:PROTEIN
Mol. Mass.:49370.42
Organism:Mus musculus
Description:n/a
Residue:435
BDBM50364359
NameBDBM50364359
Synonyms:CHEMBL1950274
TypeSmall organic molecule
Emp. Form.C21H31N5O7
Mol. Mass.465.5001
SMILESCCOC(=O)\C=C\C(=O)N(CC(N)=O)NC(=O)[C@@H]1CCCN1C(=O)[C@H]1CCCCN1C(C)=O