Reaction Details
TargetLegumain
LigandBDBM228618
Substrate/Competitorn/a
Meas. Tech.ChEMBL_805028 (CHEMBL1952889)
IC50 8.3±n/a nM
Citation Lee, JBogyo, M Synthesis and evaluation of aza-peptidyl inhibitors of the lysosomal asparaginyl endopeptidase, legumain. Bioorg Med Chem Lett22:1340-3 (2012) 
 
Legumain
Name:Legumain
Type:PROTEIN
Mol. Mass.:49370.42
Organism:Mus musculus
Description:n/a
Residue:435
BDBM228618
NameBDBM228618
Synonyms:BDBM50364365 | US9345789, LI-2
TypeSmall organic molecule
Emp. Form.C15H22N4O6
Mol. Mass.354.3584
SMILESCCOC(=O)\C=C\C(=O)N(CC(N)=O)NC(=O)[C@@H]1CCCN1C(C)=O