Reaction Details
TargetLysosomal Pro-X carboxypeptidase
LigandBDBM50364386
Substrate/Competitorn/a
Meas. Tech.ChEMBL_805215 (CHEMBL1955693)
IC50 0.17±n/a nM
Citation Wu, ZYang, CXiong, YFeng, ZLombardo, MVerras, AChabin, RMXu, STong, XXie, DLassman, MEBhatt, URGarcia-Calvo, MMGeissler, WShen, ZChen, QSinharoy, RHale, JJTata, JRPinto, SShen, DMColletti, SL Discovery of a new class of potent prolylcarboxypeptidase inhibitors derived from alanine. Bioorg Med Chem Lett22:1774-8 (2012) 
 
Lysosomal Pro-X carboxypeptidase
Name:Lysosomal Pro-X carboxypeptidase
Type:Enzyme
Mol. Mass.:55805.19
Organism:Homo sapiens (Human)
Description:P42785
Residue:496
BDBM50364386
NameBDBM50364386
Synonyms:CHEMBL1950440
TypeSmall organic molecule
Emp. Form.C25H28Cl2F3N5O3
Mol. Mass.574.423
SMILESC[C@H](NC(=O)[C@@H](NC(=O)C(C)(C)N)[C@@H](C)c1ccc(OCC(F)(F)F)cc1)c1nc2cc(Cl)c(Cl)cc2[nH]1