Reaction Details
TargetLysosomal Pro-X carboxypeptidase
LigandBDBM50364393
Substrate/Competitorn/a
Meas. Tech.ChEMBL_805215 (CHEMBL1955693)
IC50 5±n/a nM
Citation Wu, ZYang, CXiong, YFeng, ZLombardo, MVerras, AChabin, RMXu, STong, XXie, DLassman, MEBhatt, URGarcia-Calvo, MMGeissler, WShen, ZChen, QSinharoy, RHale, JJTata, JRPinto, SShen, DMColletti, SL Discovery of a new class of potent prolylcarboxypeptidase inhibitors derived from alanine. Bioorg Med Chem Lett22:1774-8 (2012) 
 
Lysosomal Pro-X carboxypeptidase
Name:Lysosomal Pro-X carboxypeptidase
Type:Enzyme
Mol. Mass.:55805.19
Organism:Homo sapiens (Human)
Description:P42785
Residue:496
BDBM50364393
NameBDBM50364393
Synonyms:CHEMBL1950309
TypeSmall organic molecule
Emp. Form.C22H24Cl2FN5O
Mol. Mass.464.363
SMILESC[C@H](NC(=O)CCN1CCN(CC1)c1cccc(F)c1)c1nc2cc(Cl)c(Cl)cc2[nH]1