Reaction Details
TargetTransient receptor potential cation channel subfamily V member 1
LigandBDBM50240419
Substrate/Competitorn/a
Meas. Tech.ChEMBL_802411 (CHEMBL1954854)
IC50 290±n/a nM
Citation Morera, EDe Petrocellis, LMorera, LMoriello, ASNalli, MDi Marzo, VOrtar, G Synthesis and biological evaluation of [6]-gingerol analogues as transient receptor potential channel TRPV1 and TRPA1 modulators. Bioorg Med Chem Lett22:1674-7 (2012) 
 
Transient receptor potential cation channel subfamily V member 1
Name:Transient receptor potential cation channel subfamily V member 1
Type:Protein
Mol. Mass.:94960.75
Organism:Homo sapiens (Human)
Description:Q8NER1
Residue:839
BDBM50240419
NameBDBM50240419
Synonyms:(E)-1-(4-Hydroxy-3-methoxy-phenyl)-dec-4-en-3-one CHEMBL25948 [6]-shogaol | trans-6-shogaol
TypeSmall organic molecule
Emp. Form.C17H24O3
Mol. Mass.276.3707
SMILESCCCCCC=CC(=O)CCc1ccc(O)c(OC)c1