Reaction Details
TargetBaculoviral IAP repeat-containing protein 2
LigandBDBM50364494
Substrate/Competitorn/a
Meas. Tech.ChEMBL_802615 (CHEMBL1952922)
IC50 24±n/a nM
Citation Hennessy, EJSaeh, JCSha, LMacIntyre, TWang, HLarsen, NAAquila, BMFerguson, ADLaing, NMOmer, CA Discovery of aminopiperidine-based Smac mimetics as IAP antagonists. Bioorg Med Chem Lett22:1690-4 (2012) 
 
Baculoviral IAP repeat-containing protein 2
Name:Baculoviral IAP repeat-containing protein 2
Type:Protein
Mol. Mass.:69900.47
Organism:Homo sapiens (Human)
Description:Q13490
Residue:618
BDBM50364494
NameBDBM50364494
Synonyms:CHEMBL1950856
TypeSmall organic molecule
Emp. Form.C23H37BrN4O2
Mol. Mass.481.469
SMILESCN[C@@H](C)C(=O)N[C@H](C(=O)N[C@H]1CCCN(CCc2ccc(Br)cc2)C1)C(C)(C)C