Reaction Details
TargetProstaglandin D2 receptor 2
LigandBDBM50364524
Substrate/Competitorn/a
Meas. Tech.ChEMBL_802808 (CHEMBL1953542)
IC50 3±n/a nM
Citation Liu, JJWang, YJohnson, MGLi, ARShen, WWang, XSu, YBrown, MVan Lengerich, BRickel, EMartin, TBudelsky, ASeitz, LDanao, JTang, HLCollins, TMedina, JC Optimization of phenylacetic acid derivatives for balanced CRTH2 and DP dual antagonists. Bioorg Med Chem Lett22:1686-9 (2012) 
 
Prostaglandin D2 receptor 2
Name:Prostaglandin D2 receptor 2
Type:Enzyme
Mol. Mass.:43295.45
Organism:Homo sapiens (Human)
Description:Q9Y5Y4
Residue:395
BDBM50364524
NameBDBM50364524
Synonyms:CHEMBL1950867
TypeSmall organic molecule
Emp. Form.C27H25Cl2N3O6S
Mol. Mass.590.475
SMILESCCCCNC(=O)c1ccc(Oc2ccc3c(CC(O)=O)c[nH]c3c2)c(NS(=O)(=O)c2ccc(Cl)cc2Cl)c1