Reaction Details
TargetProstaglandin D2 receptor 2
LigandBDBM50364528
Substrate/Competitorn/a
Meas. Tech.ChEMBL_802808 (CHEMBL1953542)
IC50 2±n/a nM
Citation Liu, JJWang, YJohnson, MGLi, ARShen, WWang, XSu, YBrown, MVan Lengerich, BRickel, EMartin, TBudelsky, ASeitz, LDanao, JTang, HLCollins, TMedina, JC Optimization of phenylacetic acid derivatives for balanced CRTH2 and DP dual antagonists. Bioorg Med Chem Lett22:1686-9 (2012) 
 
Prostaglandin D2 receptor 2
Name:Prostaglandin D2 receptor 2
Type:Enzyme
Mol. Mass.:43295.45
Organism:Homo sapiens (Human)
Description:Q9Y5Y4
Residue:395
BDBM50364528
NameBDBM50364528
Synonyms:CHEMBL1950871
TypeSmall organic molecule
Emp. Form.C27H28Cl2N2O6S
Mol. Mass.579.492
SMILESCCCCNC(=O)c1ccc(Cc2ccc(CC(O)=O)cc2OC)c(NS(=O)(=O)c2ccc(Cl)cc2Cl)c1