Reaction Details
TargetProstaglandin D2 receptor
LigandBDBM50364527
Substrate/Competitorn/a
Meas. Tech.ChEMBL_802809 (CHEMBL1953543)
IC50 5±n/a nM
Citation Liu, JJWang, YJohnson, MGLi, ARShen, WWang, XSu, YBrown, MVan Lengerich, BRickel, EMartin, TBudelsky, ASeitz, LDanao, JTang, HLCollins, TMedina, JC Optimization of phenylacetic acid derivatives for balanced CRTH2 and DP dual antagonists. Bioorg Med Chem Lett22:1686-9 (2012) 
 
Prostaglandin D2 receptor
Name:Prostaglandin D2 receptor
Type:Enzyme
Mol. Mass.:40288.87
Organism:Homo sapiens (Human)
Description:Q13258
Residue:359
BDBM50364527
NameBDBM50364527
Synonyms:CHEMBL1950870
TypeSmall organic molecule
Emp. Form.C27H24Cl2N2O7S
Mol. Mass.591.46
SMILESCCCCNC(=O)c1ccc(Oc2ccc3c(CC(O)=O)coc3c2)c(NS(=O)(=O)c2ccc(Cl)cc2Cl)c1