Reaction Details
TargetProstaglandin D2 receptor
LigandBDBM50364534
Substrate/Competitorn/a
Meas. Tech.ChEMBL_802809 (CHEMBL1953543)
IC50 10±n/a nM
Citation Liu, JJWang, YJohnson, MGLi, ARShen, WWang, XSu, YBrown, MVan Lengerich, BRickel, EMartin, TBudelsky, ASeitz, LDanao, JTang, HLCollins, TMedina, JC Optimization of phenylacetic acid derivatives for balanced CRTH2 and DP dual antagonists. Bioorg Med Chem Lett22:1686-9 (2012) 
 
Prostaglandin D2 receptor
Name:Prostaglandin D2 receptor
Type:Enzyme
Mol. Mass.:40288.87
Organism:Homo sapiens (Human)
Description:Q13258
Residue:359
BDBM50364534
NameBDBM50364534
Synonyms:CHEMBL1950877
TypeSmall organic molecule
Emp. Form.C26H24Cl2N4O6S
Mol. Mass.591.463
SMILESCCCc1nnc([nH]1)-c1ccc(Oc2ccc(CC(O)=O)cc2OC)c(NS(=O)(=O)c2ccc(Cl)cc2Cl)c1