Reaction Details
TargetCytochrome P450 3A5
LigandBDBM50364651
Substrate/Competitorn/a
Meas. Tech.ChEMBL_802674 (CHEMBL1953082)
IC50 44000±n/a nM
Citation Song, XLi, XRuiz, CHYin, YFeng, YKamenecka, TMCameron, MD Imidazopyridines as selective CYP3A4 inhibitors. Bioorg Med Chem Lett22:1611-4 (2012) 
 
Cytochrome P450 3A5
Name:Cytochrome P450 3A5
Type:Protein
Mol. Mass.:57118.00
Organism:Homo sapiens (Human)
Description:P20815
Residue:502
BDBM50364651
NameBDBM50364651
Synonyms:CHEMBL1951348
TypeSmall organic molecule
Emp. Form.C23H21ClN6O2
Mol. Mass.448.905
SMILESCC(C)NC(=O)c1cccc(NC(=O)Nc2ccc(cc2)-c2ncnc3[nH]cc(Cl)c23)c1