Reaction Details
TargetLysosomal Pro-X carboxypeptidase
LigandBDBM50364666
Substrate/Competitorn/a
Meas. Tech.ChEMBL_802881 (CHEMBL1953699)
IC50 1.9±n/a nM
Citation Shen, HCDing, FXJiang, JVerras, AChabin, RMXu, STong, XChen, QXie, DLassman, MEBhatt, URGarcia-Calvo, MMGeissler, WShen, ZMurphy, BAGorski, JNWiltsie, JSinhaRoy, RHale, JJPinto, SShen, DM Discovery of benzodihydroisofurans as novel, potent, bioavailable and brain-penetrant prolylcarboxypeptidase inhibitors. Bioorg Med Chem Lett22:1550-6 (2012) 
 
Lysosomal Pro-X carboxypeptidase
Name:Lysosomal Pro-X carboxypeptidase
Type:Enzyme
Mol. Mass.:55805.19
Organism:Homo sapiens (Human)
Description:P42785
Residue:496
BDBM50364666
NameBDBM50364666
Synonyms:CHEMBL1951456
TypeSmall organic molecule
Emp. Form.C26H22Cl2F3NO2
Mol. Mass.508.36
SMILESFC(F)(F)Oc1ccc(CN2CCC3(CC2)OC(c2ccccc32)c2cc(Cl)cc(Cl)c2)cc1