Reaction Details
TargetLysosomal Pro-X carboxypeptidase
LigandBDBM50364667
Substrate/Competitorn/a
Meas. Tech.ChEMBL_802881 (CHEMBL1953699)
IC50 23±n/a nM
Citation Shen, HCDing, FXJiang, JVerras, AChabin, RMXu, STong, XChen, QXie, DLassman, MEBhatt, URGarcia-Calvo, MMGeissler, WShen, ZMurphy, BAGorski, JNWiltsie, JSinhaRoy, RHale, JJPinto, SShen, DM Discovery of benzodihydroisofurans as novel, potent, bioavailable and brain-penetrant prolylcarboxypeptidase inhibitors. Bioorg Med Chem Lett22:1550-6 (2012) 
 
Lysosomal Pro-X carboxypeptidase
Name:Lysosomal Pro-X carboxypeptidase
Type:Enzyme
Mol. Mass.:55805.19
Organism:Homo sapiens (Human)
Description:P42785
Residue:496
BDBM50364667
NameBDBM50364667
Synonyms:CHEMBL1951455
TypeSmall organic molecule
Emp. Form.C27H23Cl2NO2
Mol. Mass.464.383
SMILESClc1cc(Cl)cc(c1)C1OC2(CCN(Cc3cc4ccccc4o3)CC2)c2ccccc12