Reaction Details
TargetLysosomal Pro-X carboxypeptidase
LigandBDBM50364689
Substrate/Competitorn/a
Meas. Tech.ChEMBL_802881 (CHEMBL1953699)
IC50 0.78±n/a nM
Citation Shen, HCDing, FXJiang, JVerras, AChabin, RMXu, STong, XChen, QXie, DLassman, MEBhatt, URGarcia-Calvo, MMGeissler, WShen, ZMurphy, BAGorski, JNWiltsie, JSinhaRoy, RHale, JJPinto, SShen, DM Discovery of benzodihydroisofurans as novel, potent, bioavailable and brain-penetrant prolylcarboxypeptidase inhibitors. Bioorg Med Chem Lett22:1550-6 (2012) 
 
Lysosomal Pro-X carboxypeptidase
Name:Lysosomal Pro-X carboxypeptidase
Type:Enzyme
Mol. Mass.:55805.19
Organism:Homo sapiens (Human)
Description:P42785
Residue:496
BDBM50364689
NameBDBM50364689
Synonyms:CHEMBL1951478
TypeSmall organic molecule
Emp. Form.C23H19ClF3N3O4S
Mol. Mass.525.928
SMILES[O-][n+]1ccc(Cl)cc1C1OC2(CCN(CC2)S(=O)(=O)c2ccc(cn2)C(F)(F)F)c2ccccc12